BDBM22175 1-[(2R)-2-benzylpropyl]-4-{2-[bis(4-fluorophenyl)methoxy]ethyl}piperazine::GBR 12935 Analogue, (-)-7
SMILES C[C@@H](CN1CCN(CCOC(c2ccc(F)cc2)c2ccc(F)cc2)CC1)Cc1ccccc1
InChI Key InChIKey=QUOVWZCNMCSUEF-HSZRJFAPSA-N
Data  2 KI
  Tab Delimited (TSV)   2D SDfile   Computed 3D by Vconf -m prep SDfile
Find this compound or compounds like it in BindingDB:
Activity Spreadsheet -- Enzyme Inhibition Constant Data from BindingDB
Found 2 hits for monomerid = 22175
TargetSodium-dependent dopamine transporter(Rattus norvegicus (rat))
National Taiwan University
LigandPNGBDBM22175(1-[(2R)-2-benzylpropyl]-4-{2-[bis(4-fluorophenyl)m...)
Affinity DataKi:  17nM ΔG°:  -9.85kcal/molepH: 7.4 T: 2°C. Assay description: The assay was initiated by the addition of membranes to binding buffer containing test compound, blocker, and radioligand. The samples were incubated...
In DepthDetails ArticlePubMed
TargetSodium-dependent serotonin transporter(Rattus norvegicus (rat))
National Taiwan University
LigandPNGBDBM22175(1-[(2R)-2-benzylpropyl]-4-{2-[bis(4-fluorophenyl)m...)
Affinity DataKi:  190nM. Assay description: The assay was initiated by the addition of membranes to binding buffer containing test compound, blocker, and radioligand. The samples were incubated...
In DepthDetails ArticlePubMed