BDBM22178 1-{2-[bis(4-fluorophenyl)methoxy]ethyl}-4-[(2S)-2-methoxy-3-phenylpropyl]piperazine::GBR 12935 Analogue, (S)-9
SMILES CO[C@H](CN1CCN(CCOC(c2ccc(F)cc2)c2ccc(F)cc2)CC1)Cc1ccccc1
InChI Key InChIKey=SPVLIWURVCWIKT-NDEPHWFRSA-N
Data  2 KI
  Tab Delimited (TSV)   2D SDfile   Computed 3D by Vconf -m prep SDfile
Find this compound or compounds like it in BindingDB:
Activity Spreadsheet -- Enzyme Inhibition Constant Data from BindingDB
Found 2 hits for monomerid = 22178
TargetSodium-dependent dopamine transporter(Rattus norvegicus (rat))
National Taiwan University
LigandPNGBDBM22178(1-{2-[bis(4-fluorophenyl)methoxy]ethyl}-4-[(2S)-2-...)
Affinity DataKi:  29nM ΔG°:  -9.55kcal/molepH: 7.4 T: 2°C. Assay description: The assay was initiated by the addition of membranes to binding buffer containing test compound, blocker, and radioligand. The samples were incubated...
In DepthDetails ArticlePubMed
TargetSodium-dependent serotonin transporter(Rattus norvegicus (rat))
National Taiwan University
LigandPNGBDBM22178(1-{2-[bis(4-fluorophenyl)methoxy]ethyl}-4-[(2S)-2-...)
Affinity DataKi:  220nM. Assay description: The assay was initiated by the addition of membranes to binding buffer containing test compound, blocker, and radioligand. The samples were incubated...
In DepthDetails ArticlePubMed