BDBM22182 3-(4-{2-[bis(4-fluorophenyl)methoxy]ethyl}piperazin-1-yl)-1-phenylpropan-1-one::CHEMBL283662::GBR 12935 Analogue, 11
SMILES Fc1ccc(cc1)C(OCCN1CCN(CCC(=O)c2ccccc2)CC1)c1ccc(F)cc1
InChI Key InChIKey=OSLVNNRVAWCDKE-UHFFFAOYSA-N
Data  6 KI  2 IC50
  Tab Delimited (TSV)   2D SDfile   Computed 3D by Vconf -m prep SDfile
Find this compound or compounds like it in BindingDB:
Activity Spreadsheet -- Enzyme Inhibition Constant Data from BindingDB
Found 8 hits for monomerid = 22182
TargetSodium-dependent dopamine transporter(Rattus norvegicus (rat))
National Institute Of Diabetes And Digestive And Kidney Diseases
Curated by ChEMBL
LigandPNGBDBM22182(3-(4-{2-[bis(4-fluorophenyl)methoxy]ethyl}piperazi...)
Affinity DataKi:  47.8nM. Assay description: Binding affinity against dopamine transporter labelled with [125I]- RTI-55 in rat.
In DepthDetails ArticlePubMed
TargetSodium-dependent dopamine transporter(Rattus norvegicus (rat))
National Institute Of Diabetes And Digestive And Kidney Diseases
Curated by ChEMBL
LigandPNGBDBM22182(3-(4-{2-[bis(4-fluorophenyl)methoxy]ethyl}piperazi...)
Affinity DataKi:  48nM ΔG°:  -9.27kcal/molepH: 7.4 T: 2°C. Assay description: The assay was initiated by the addition of membranes to binding buffer containing test compound, blocker, and radioligand. The samples were incubated...
In DepthDetails ArticlePubMed
TargetSodium-dependent dopamine transporter(Rattus norvegicus (rat))
National Institute Of Diabetes And Digestive And Kidney Diseases
Curated by ChEMBL
LigandPNGBDBM22182(3-(4-{2-[bis(4-fluorophenyl)methoxy]ethyl}piperazi...)
Affinity DataKi:  48nM. Assay description: Binding affinity of the compound towards dopamine transporter (DAT)
In DepthDetails ArticlePubMed
TargetSodium-dependent serotonin transporter(Rattus norvegicus (rat))
National Institute Of Diabetes And Digestive And Kidney Diseases
Curated by ChEMBL
LigandPNGBDBM22182(3-(4-{2-[bis(4-fluorophenyl)methoxy]ethyl}piperazi...)
Affinity DataKi:  215nM. Assay description: Binding affinity against Serotonin transporter (SERT) labelled with [125I]-RTI-55 in rat.
In DepthDetails ArticlePubMed
TargetSodium-dependent serotonin transporter(Rattus norvegicus (rat))
National Institute Of Diabetes And Digestive And Kidney Diseases
Curated by ChEMBL
LigandPNGBDBM22182(3-(4-{2-[bis(4-fluorophenyl)methoxy]ethyl}piperazi...)
Affinity DataKi:  220nM. Assay description: Binding affinity towards rat serotonin transporter (SERT)
In DepthDetails ArticlePubMed
TargetSodium-dependent serotonin transporter(Rattus norvegicus (rat))
National Institute Of Diabetes And Digestive And Kidney Diseases
Curated by ChEMBL
LigandPNGBDBM22182(3-(4-{2-[bis(4-fluorophenyl)methoxy]ethyl}piperazi...)
Affinity DataKi:  220nM. Assay description: The assay was initiated by the addition of membranes to binding buffer containing test compound, blocker, and radioligand. The samples were incubated...
In DepthDetails ArticlePubMed
TargetSodium-dependent serotonin transporter(Rattus norvegicus (rat))
National Institute Of Diabetes And Digestive And Kidney Diseases
Curated by ChEMBL
LigandPNGBDBM22182(3-(4-{2-[bis(4-fluorophenyl)methoxy]ethyl}piperazi...)
Affinity DataIC50:  452nM. Assay description: Reuptake inhibition of [3H]-5-HT (5-HT) in rat.
In DepthDetails ArticlePubMed
TargetSodium-dependent dopamine transporter(Rattus norvegicus (rat))
National Institute Of Diabetes And Digestive And Kidney Diseases
Curated by ChEMBL
LigandPNGBDBM22182(3-(4-{2-[bis(4-fluorophenyl)methoxy]ethyl}piperazi...)
Affinity DataIC50:  41.6nM. Assay description: Reuptake inhibition of [3H]-labeled dopamine (DA) in rat.
In DepthDetails ArticlePubMed