BDBM22186 4-(4-{2-[bis(4-fluorophenyl)methoxy]ethyl}piperazin-1-yl)-2-phenylbutan-2-ol::GBR 12935 Analogue, 15
SMILES CC(O)(CCN1CCN(CCOC(c2ccc(F)cc2)c2ccc(F)cc2)CC1)c1ccccc1
InChI Key InChIKey=AIFFHNCKAUEKKT-UHFFFAOYSA-N
Data  2 KI
  Tab Delimited (TSV)   2D SDfile   Computed 3D by Vconf -m prep SDfile
Find this compound or compounds like it in BindingDB:
Activity Spreadsheet -- Enzyme Inhibition Constant Data from BindingDB
Found 2 hits for monomerid = 22186
TargetSodium-dependent dopamine transporter(Rattus norvegicus (rat))
National Taiwan University
LigandPNGBDBM22186(4-(4-{2-[bis(4-fluorophenyl)methoxy]ethyl}piperazi...)
Affinity DataKi:  4nM ΔG°:  -10.6kcal/molepH: 7.4 T: 2°C. Assay description: The assay was initiated by the addition of membranes to binding buffer containing test compound, blocker, and radioligand. The samples were incubated...
In DepthDetails ArticlePubMed
TargetSodium-dependent serotonin transporter(Rattus norvegicus (rat))
National Taiwan University
LigandPNGBDBM22186(4-(4-{2-[bis(4-fluorophenyl)methoxy]ethyl}piperazi...)
Affinity DataKi:  150nM. Assay description: The assay was initiated by the addition of membranes to binding buffer containing test compound, blocker, and radioligand. The samples were incubated...
In DepthDetails ArticlePubMed