BDBM221988 US9303035, 9b
SMILES Cn1c2c3C(OC(CO)Cn3c(-c3cccc(c3)C#N)c2c(=O)n(C)c1=O)c1nc(Cl)cs1
InChI Key InChIKey=GMANXRNKIWGMRW-UHFFFAOYSA-N
Data  1 IC50
  Tab Delimited (TSV)   2D SDfile   Computed 3D by Vconf -m prep SDfile
Find this compound or compounds like it in BindingDB:
Activity Spreadsheet -- Enzyme Inhibition Constant Data from BindingDB
Found 1 hit for monomerid = 221988
TargetCystic fibrosis transmembrane conductance regulator(Cricetulus griseus (Chinese hamster))
Novartis
US Patent
LigandPNGBDBM221988(US9303035, 9b)
Affinity DataIC50:  8.06nM. Assay description: CFTR activity can be quantified by electrophysiology methods, using the whole-cell configuration of the patch clamp technique (Hamill O, Marty A, Neh...
Ligand InfoPC cidPC sid
In DepthDetails US Patent