BDBM222280 6-(3,5-Dimethyl-4-nitro-1H-pyrazol-1-yl)-N-(3,4-dimethylphenyl)pyridazin-3-amine (5e)
SMILES Cc1nn(c(C)c1[N+]([O-])=O)-c1ccc(Nc2ccc(C)c(C)c2)nn1
InChI Key InChIKey=YTQRLUUWSVFOCD-UHFFFAOYSA-N
Data  1 IC50
  Tab Delimited (TSV)   2D SDfile   Computed 3D by Vconf -m prep SDfile
Find this compound or compounds like it in BindingDB:
Activity Spreadsheet -- Enzyme Inhibition Constant Data from BindingDB
Found 1 hit for monomerid = 222280
TargetOligo-1,6-glucosidase IMA1(Saccharomyces cerevisiae S288c (Baker's yeast))
University of The Punjab
LigandPNGBDBM222280(6-(3,5-Dimethyl-4-nitro-1H-pyrazol-1-yl)-N-(3,4-di...)
Affinity DataIC50:  1.72E+5nMpH: 6.8 T: 2°C. Assay description: The enzyme assays were done in the initial linear parts of the assay curve with suitable positive and negative controls (data not shown). A total of ...
Ligand InfoPC cidPC sid
In DepthDetails ArticlePubMed