BDBM223300 EphA4-LBC inhibitor, Compound 22
SMILES NCCC(=O)N[C@@H](Cc1c[nH]c2ccc(O)cc12)C(=O)N[C@@H](Cc1ccc(Cl)cc1)C(=O)N[C@@H](Cc1ccncc1)C(=O)N[C@H](Cc1c[nH]c2ccccc12)C(N)=O
InChI Key
Data  1 KI  2 Kd
  Tab Delimited (TSV)   2D SDfile   Computed 3D by Vconf -m prep SDfile
Find this compound or compounds like it in BindingDB:
Activity Spreadsheet -- Enzyme Inhibition Constant Data from BindingDB
Found 3 hits for monomerid = 223300
TargetEphrin type-A receptor 4 [29-209](Homo sapiens (Human))
Sanford Burnham Prebys Medical Discovery Institute
LigandPNGBDBM223300(EphA4-LBC inhibitor, Compound 22)
Affinity DataKi:  2.14E+3nM ΔG°:  -7.73kcal/molepH: 7.2 T: 2°C. Assay description: For competitive binding assays, 1 mL of 200 mM EphA4-LBD was pre-incubated with the tested compounds at various concentrations in 98 mL of PBS (pH 7....
Ligand InfoPC cidPC sid
In DepthDetails ArticlePubMed
TargetEphrin type-A receptor 4(Homo sapiens (Human))
University Of Parma
Curated by ChEMBL
LigandPNGBDBM223300(EphA4-LBC inhibitor, Compound 22)
Affinity DataKd:  1.20E+3nM. Assay description: Binding affinity to EphA4 ligand binding domain (unknown origin) by ITC
Ligand InfoPC cidPC sid
In DepthDetails ArticlePubMed
TargetEphrin type-A receptor 4 [29-209](Homo sapiens (Human))
Sanford Burnham Prebys Medical Discovery Institute
LigandPNGBDBM223300(EphA4-LBC inhibitor, Compound 22)
Affinity DataKd:  1.20E+3nMpH: 6.5 T: 2°C. Assay description: The purified EphA proteins (EphA4-LBD, EphA3-LBD, and EphA2-LBD) were dissolved in 50 mM potassium phosphate buffer (pH 6.5) containing 100 mM NaCl. ...
Ligand InfoPC cidPC sid
In DepthDetails ArticlePubMed