BDBM224643 US9328111, 16
SMILES CC1(CC1)C(=O)N1CCc2c(C1)[nH]c1cccc3c1c2n[nH]c3=O
InChI Key InChIKey=VBERQHBAANPUAP-UHFFFAOYSA-N
Data  1 IC50
  Tab Delimited (TSV)   2D SDfile   Computed 3D by Vconf -m prep SDfile
Find this compound or compounds like it in BindingDB:
Activity Spreadsheet -- Enzyme Inhibition Constant Data from BindingDB
Found 1 hit for monomerid = 224643
TargetPoly [ADP-ribose] polymerase 1(Homo sapiens (Human))
Beigene
US Patent
LigandPNGBDBM224643(US9328111, 16)
Affinity DataIC50:  7.20nMpH: 8.0Assay Description:PARP1 enzymatic assay was conducted using a method modified from HT F Homogeneous PARP Inhibition Assay Kit (Trevigen). 8.8 nM PARP1 was pre-incubate...
Ligand InfoPC cidPC sid
In DepthDetails US Patent