BDBM225321 CS247
SMILES COc1cccc(OC)c1CNC(=O)c1ccc2NC(=O)\C(=N/Nc3ccc(cc3)S(N)(=O)=O)c2c1
InChI Key InChIKey=VVJVXBGHOZRDRF-UHFFFAOYSA-N
Data  1 Kd  1 Koff  1 Kon
  Tab Delimited (TSV)   2D SDfile   Computed 3D by Vconf -m prep SDfile
Find this compound or compounds like it in BindingDB:
Activity Spreadsheet -- Enzyme Inhibition Constant Data from BindingDB
Found 3 hits for monomerid = 225321
TargetCyclin-dependent kinase 2(Homo sapiens (Human))
D3R/Abbott
LigandPNGBDBM225321(CS247)
Affinity DataKd:  22.6nM. Assay description: OctetRed_Method1
Ligand InfoPC cidPC sid
In DepthDetails PubMed
TargetCyclin-dependent kinase 2(Homo sapiens (Human))
D3R/Abbott
LigandPNGBDBM225321(CS247)
Affinity DataKon:  0.00230M-1s-1Assay Description:OctetRed_Method3
Ligand InfoPC cidPC sid
In DepthDetails PubMed
TargetCyclin-dependent kinase 2(Homo sapiens (Human))
D3R/Abbott
LigandPNGBDBM225321(CS247)
Affinity DataKoff:  9.18E+4s-1Assay Description:OctetRed_Method3
Ligand InfoPC cidPC sid
In DepthDetails PubMed