BDBM225395 Sacchettini_22
SMILES Cc1c(\C=C\c2ccccc2)cccc1C(=O)\C=C(/O)C(O)=O
InChI Key InChIKey=JEAKVBICUJAQOY-DNUBFSQISA-N
Data  1 IC50
  Tab Delimited (TSV)   2D SDfile   Computed 3D by Vconf -m prep SDfile
Find this compound or compounds like it in BindingDB:
Activity Spreadsheet -- Enzyme Inhibition Constant Data from BindingDB
Found 1 hit for monomerid = 225395
TargetMalate synthase G [C619A](Mycobacterium tuberculosis (strain CDC 1551 / Oshk...)
D3R/Abbott
LigandPNGBDBM225395(Sacchettini_22)
Affinity DataIC50: >1.00E+5nM. Assay description: DNTB-Coupled_Enzyme_Assay
Ligand InfoPC cidPC sid
In DepthDetails PubMed