BDBM227354 US9328106, 305
SMILES C[C@H](O)c1cc(F)c(-c2nc(cs2)C(=O)Nc2cnn(C)c2[C@@H]2CC[C@@H](N)[C@H](F)CO2)c(F)c1
InChI Key InChIKey=MXBZZFKFYONNMS-VCZPNBCRSA-N
Data  1 KI
  Tab Delimited (TSV)   2D SDfile   Computed 3D by Vconf -m prep SDfile
Find this compound or compounds like it in BindingDB:
Activity Spreadsheet -- Enzyme Inhibition Constant Data from BindingDB
Found 1 hit for monomerid = 227354
TargetSerine/threonine-protein kinase pim-1(Homo sapiens (Human))
Genentech
US Patent
LigandPNGBDBM227354(US9328106, 305)
Affinity DataKi:  0.00800nM ΔG°:  -15.1kcal/molepH: 7.2 T: 2°C. Assay description: LC3K assay: PIM-1, -2, and -3 enzymes were generated as fusion proteins expressed in bacteria and purified by IMAC column chromatography (Sun, X., Ch...
Ligand InfoPC cidPC sid
In DepthDetails US Patent