BDBM230831 US9340537, 85::US9896444, Example 86
SMILES OC1CCN(CC1)c1ncc(cc1-c1ccn[nH]1)C(=O)Nc1ccc(OC(F)(F)Cl)cc1
InChI Key InChIKey=OKFSROGRACDCBO-UHFFFAOYSA-N
Data  6 IC50
  Tab Delimited (TSV)   2D SDfile   Computed 3D by Vconf -m prep SDfile
Find this compound or compounds like it in BindingDB:
Activity Spreadsheet -- Enzyme Inhibition Constant Data from BindingDB
Found 6 hits for monomerid = 230831
TargetTyrosine-protein kinase ABL1 [64-515](Homo sapiens (Human))
Novatis
US Patent
LigandPNGBDBM230831(US9340537, 85 | US9896444, Example 86)
Affinity DataIC50:  2nMpH: 7.5 T: 2°C. Assay description: The assay was performed by mixing 10 μL of the compound pre-diluted with 10 μL of ATP (20 μM ATP with 0.1 μCi [γ-33P]-ATP) with the...
Ligand InfoPC cidPC sid
In DepthDetails US Patent
TargetTyrosine-protein kinase ABL1 [64-515](Homo sapiens (Human))
Novatis
US Patent
LigandPNGBDBM230831(US9340537, 85 | US9896444, Example 86)
Affinity DataIC50:  0.700nMpH: 7.5 T: 2°C. Assay description: The assay plates were prepared by addition of 50 nL per well of compound solution in 90% DMSO. The kinase reactions were started by stepwise addition...
Ligand InfoPC cidPC sid
In DepthDetails US Patent
TargetTyrosine-protein kinase ABL1 [64-515](Homo sapiens (Human))
Novatis
US Patent
LigandPNGBDBM230831(US9340537, 85 | US9896444, Example 86)
Affinity DataIC50:  1.5nM. Assay description: Caliper ABL1 (64-515) Assay: The assay plates were prepared by addition of 50 nL per well of compound solution in 90% DMSO. The kinase reactions were...
Ligand InfoPC cidPC sid
In DepthDetails US Patent
TargetTyrosine-protein kinase ABL1 [64-515](Homo sapiens (Human))
Novatis
US Patent
LigandPNGBDBM230831(US9340537, 85 | US9896444, Example 86)
Affinity DataIC50:  0.700nM. Assay description: Caliper ABL1 (64-515) Assay: The assay plates were prepared by addition of 50 nL per well of compound solution in 90% DMSO. The kinase reactions were...
Ligand InfoPC cidPC sid
In DepthDetails US Patent
TargetTyrosine-protein kinase ABL1 [64-515](Homo sapiens (Human))
Novatis
US Patent
LigandPNGBDBM230831(US9340537, 85 | US9896444, Example 86)
Affinity DataIC50:  4nM. Assay description: Radio ABL1 (64-515) Assay: For determination of ABL kinase activity, the radiometric filter-binding assay was used. The assay was performed by mixing...
Ligand InfoPC cidPC sid
In DepthDetails US Patent
TargetTyrosine-protein kinase ABL1 [64-515](Homo sapiens (Human))
Novatis
US Patent
LigandPNGBDBM230831(US9340537, 85 | US9896444, Example 86)
Affinity DataIC50:  2nM. Assay description: Radio ABL1 (64-515) Assay: For determination of ABL kinase activity, the radiometric filter-binding assay was used. The assay was performed by mixing...
Ligand InfoPC cidPC sid
In DepthDetails US Patent