BDBM232328 US9346794, 32
SMILES CC(C)n1cc(C(=O)NCc2ccc(c(F)c2)S(C)(=O)=NC#N)c(=O)c(c1C)-c1cccc(c1)C(F)F
InChI Key InChIKey=GWCJWFQAHDVBJQ-UHFFFAOYSA-N
Data  1 IC50
  Tab Delimited (TSV)   2D SDfile   Computed 3D by Vconf -m prep SDfile
Find this compound or compounds like it in BindingDB:
Activity Spreadsheet -- Enzyme Inhibition Constant Data from BindingDB
Found 1 hit for monomerid = 232328
TargetNeutrophil elastase(Homo sapiens (Human))
Boehringer Ingelheim International
US Patent
LigandPNGBDBM232328(US9346794, 32)
Affinity DataIC50:  1.10nMpH: 7.5 T: 2°C. Assay description: The following buffers were used: Compound buffer: 100 mM Tris, 500 mM NaCl, adjusted to pH 7.5; Assay buffer: 100 mM Tris, 500 mM NaCl, adjusted to p...
Ligand InfoPC cidPC sid
In DepthDetails US Patent