BDBM232333 US9346794, 37
SMILES CC(C)S(=O)(=NC#N)c1ccc(CNC(=O)c2cn(-c3ccnn3C)c(C)c(-c3cccc(c3)C(F)F)c2=O)cc1
InChI Key InChIKey=DRAPTYRXJHYRNW-UHFFFAOYSA-N
Data  1 IC50
  Tab Delimited (TSV)   2D SDfile   Computed 3D by Vconf -m prep SDfile
Find this compound or compounds like it in BindingDB:
Activity Spreadsheet -- Enzyme Inhibition Constant Data from BindingDB
Found 1 hit for monomerid = 232333
TargetNeutrophil elastase(Homo sapiens (Human))
Boehringer Ingelheim International
US Patent
LigandPNGBDBM232333(US9346794, 37)
Affinity DataIC50: <1nMpH: 7.5 T: 2°C. Assay description: The following buffers were used: Compound buffer: 100 mM Tris, 500 mM NaCl, adjusted to pH 7.5; Assay buffer: 100 mM Tris, 500 mM NaCl, adjusted to p...
Ligand InfoPC cidPC sid
In DepthDetails US Patent