BDBM233795 US9353075, 52
SMILES CC(C)[C@H]1OC(=O)[C@@H]1NC(=O)OCc1ccc(cc1)-c1ccccc1
InChI Key InChIKey=NTOPUQMJNQWIBW-QZTJIDSGSA-N
Data  1 IC50
  Tab Delimited (TSV)   2D SDfile   Computed 3D by Vconf -m prep SDfile
Find this compound or compounds like it in BindingDB:
Activity Spreadsheet -- Enzyme Inhibition Constant Data from BindingDB
Found 1 hit for monomerid = 233795
TargetN-acylethanolamine-hydrolyzing acid amidase(Homo sapiens (Human))
University of California
US Patent
LigandPNGBDBM233795(US9353075, 52)
Affinity DataIC50:  23nMpH: 4.5Assay Description:The assay was run in Optiplate 96-wells black plates, in a total reaction volume of 200 μL. NAAA protein preparation (4.0 μg) was pre-incub...
Ligand InfoPC cidPC sid
In DepthDetails US Patent