BDBM234945 US10221160, Voriconazole::US9556143, 31::US9556143, Voriconazole
SMILES CC(C)OC\C=C\c1ccc(nc1)C(F)(F)C(O)(Cn1cnnn1)c1ccc(F)cc1F
InChI Key InChIKey=DEAVNTCHXJVYSQ-ONEGZZNKSA-N
Data  9 IC50
  Tab Delimited (TSV)   2D SDfile   Computed 3D by Vconf -m prep SDfile
Find this compound or compounds like it in BindingDB:
Activity Spreadsheet -- Enzyme Inhibition Constant Data from BindingDB
Found 9 hits for monomerid = 234945
TargetCytochrome P450 2C9(Homo sapiens (Human))
Viamet Pharmaceuticals
US Patent
LigandPNGBDBM234945(US10221160, Voriconazole | US9556143, 31 | US95561...)
Affinity DataIC50:  8.10E+4nM. Assay description: Solutions of each test compound were separately prepared at concentrations of 20000, 6000, 2000, 600, 200, and 60 μM by serial dilution with DMS...
Ligand InfoPC cidPC sid
In DepthDetails US Patent
TargetCytochrome P450 2C19(Homo sapiens (Human))
Viamet Pharmaceuticals
US Patent
LigandPNGBDBM234945(US10221160, Voriconazole | US9556143, 31 | US95561...)
Affinity DataIC50:  6.10E+4nM
Ligand InfoPC cidPC sid
In DepthDetails US Patent
TargetCytochrome P450 3A4(Homo sapiens (Human))
Viamet Pharmaceuticals
US Patent
LigandPNGBDBM234945(US10221160, Voriconazole | US9556143, 31 | US95561...)
Affinity DataIC50:  3.30E+4nM
Ligand InfoPC cidPC sid
In DepthDetails US Patent
TargetCytochrome P450 2C9(Homo sapiens (Human))
Viamet Pharmaceuticals
US Patent
LigandPNGBDBM234945(US10221160, Voriconazole | US9556143, 31 | US95561...)
Affinity DataIC50:  1.40E+4nM. Assay description: Solutions of each test compound were separately prepared at concentrations of 20000, 6000, 2000, 600, 200, and 60 μM by serial dilution with DMS...
Ligand InfoPC cidPC sid
In DepthDetails US Patent
TargetCytochrome P450 3A4(Homo sapiens (Human))
Viamet Pharmaceuticals
US Patent
LigandPNGBDBM234945(US10221160, Voriconazole | US9556143, 31 | US95561...)
Affinity DataIC50:  1.30E+4nM. Assay description: Pooled human liver microsome suspension (20 mg/mL) was diluted with phosphate buffer to obtain a 5 mg/mL suspension. A solution of NADPH was prepared...
Ligand InfoPC cidPC sid
In DepthDetails US Patent
TargetCytochrome P450 3A4(Homo sapiens (Human))
Viamet Pharmaceuticals
US Patent
LigandPNGBDBM234945(US10221160, Voriconazole | US9556143, 31 | US95561...)
Affinity DataIC50:  1.30E+4nM
Ligand InfoPC cidPC sid
In DepthDetails US Patent
TargetCytochrome P450 2C9(Homo sapiens (Human))
Viamet Pharmaceuticals
US Patent
LigandPNGBDBM234945(US10221160, Voriconazole | US9556143, 31 | US95561...)
Affinity DataIC50:  1.40E+4nM. Assay description: Pooled human liver microsome suspension (20 mg/mL) was diluted with phosphate buffer to obtain a 5 mg/mL suspension. A solution of NADPH was prepared...
Ligand InfoPC cidPC sid
In DepthDetails US Patent
TargetCytochrome P450 2C19(Homo sapiens (Human))
Viamet Pharmaceuticals
US Patent
LigandPNGBDBM234945(US10221160, Voriconazole | US9556143, 31 | US95561...)
Affinity DataIC50:  1.50E+4nM. Assay description: Pooled human liver microsome suspension (20 mg/mL) was diluted with phosphate buffer to obtain a 5 mg/mL suspension. A solution of NADPH was prepared...
Ligand InfoPC cidPC sid
In DepthDetails US Patent
TargetCytochrome P450 2C19(Homo sapiens (Human))
Viamet Pharmaceuticals
US Patent
LigandPNGBDBM234945(US10221160, Voriconazole | US9556143, 31 | US95561...)
Affinity DataIC50:  1.50E+4nM
Ligand InfoPC cidPC sid
In DepthDetails US Patent