BDBM235200 US9365558, 23::US9822074, 23
SMILES FC(F)(F)CCCCCOc1ccc(cc1)[C@@]1(CC(=C(C(=O)NS(=O)(=O)C2CC2)C(=O)N1)c1ccc(CC2CC2)cc1)C(F)(F)F
InChI Key InChIKey=RVKPTQKIKMMJAO-PMERELPUSA-N
Data  2 IC50
  Tab Delimited (TSV)   2D SDfile   Computed 3D by Vconf -m prep SDfile
Find this compound or compounds like it in BindingDB:
Activity Spreadsheet -- Enzyme Inhibition Constant Data from BindingDB
Found 2 hits for monomerid = 235200
TargetAlpha-1,6-mannosyl-glycoprotein 2-beta-N-acetylglucosaminyltransferase(Homo sapiens (Human))
Bristol-Myers Squibb
US Patent
LigandPNGBDBM235200(US9365558, 23 | US9822074, 23)
Affinity DataIC50:  4nM. Assay description: The MGAT enzyme reactions were performed in Corning FALCONŽ 96-well Polypropylene plates, in a total volume of 60 μL of 50 mM Potassium Phosphat...
Ligand InfoPC cidPC sid
In DepthDetails US Patent
TargetAlpha-1,6-mannosyl-glycoprotein 2-beta-N-acetylglucosaminyltransferase(Homo sapiens (Human))
Bristol-Myers Squibb
US Patent
LigandPNGBDBM235200(US9365558, 23 | US9822074, 23)
Affinity DataIC50:  4nMpH: 7.4 T: 2°C. Assay description: The MGAT enzyme reactions were performed in Corning FALCON® 96-well Polypropylene plates, in a total volume of 60 μL of 50 mM Potassium Phosph...
Ligand InfoPC cidPC sid
In DepthDetails US Patent