BDBM235228 US9365558, 51
SMILES CC(C)n1ccc(c1)C1=C(C(=O)NS(=O)(=O)C2CC2)C(=O)N[C@@](C1)(c1ccc(CCCCC(F)(F)F)cc1F)C(F)(F)F
InChI Key InChIKey=WBBWHQCKCBCOOX-SANMLTNESA-N
Data  1 IC50
  Tab Delimited (TSV)   2D SDfile   Computed 3D by Vconf -m prep SDfile
Find this compound or compounds like it in BindingDB:
Activity Spreadsheet -- Enzyme Inhibition Constant Data from BindingDB
Found 1 hit for monomerid = 235228
TargetAlpha-1,6-mannosyl-glycoprotein 2-beta-N-acetylglucosaminyltransferase(Homo sapiens (Human))
Bristol-Myers Squibb
US Patent
LigandPNGBDBM235228(US9365558, 51)
Affinity DataIC50:  3nMpH: 7.4 T: 2°C. Assay description: The MGAT enzyme reactions were performed in Corning FALCON® 96-well Polypropylene plates, in a total volume of 60 μL of 50 mM Potassium Phosph...
Ligand InfoPC cidPC sid
In DepthDetails US Patent