BDBM235267 US9365558, 90
SMILES CS(=O)(=O)NC(=O)C1=C(C[C@](NC1=O)(c1ccc(OCCCC(F)(F)F)cc1)C(F)(F)F)c1ccn(CC2CCC2)n1
InChI Key InChIKey=OCAVTZOQGUYQDC-DEOSSOPVSA-N
Data  1 IC50
  Tab Delimited (TSV)   2D SDfile   Computed 3D by Vconf -m prep SDfile
Find this compound or compounds like it in BindingDB:
Activity Spreadsheet -- Enzyme Inhibition Constant Data from BindingDB
Found 1 hit for monomerid = 235267
TargetAlpha-1,6-mannosyl-glycoprotein 2-beta-N-acetylglucosaminyltransferase(Homo sapiens (Human))
Bristol-Myers Squibb
US Patent
LigandPNGBDBM235267(US9365558, 90)
Affinity DataIC50:  8nMpH: 7.4 T: 2°C. Assay description: The MGAT enzyme reactions were performed in Corning FALCON® 96-well Polypropylene plates, in a total volume of 60 μL of 50 mM Potassium Phosph...
Ligand InfoPC cidPC sid
In DepthDetails US Patent