BDBM236440 US9365576, 193
SMILES COc1nc(ncc1-c1cc2C(=O)N(C(c2n1C(C)C)c1ccc(Cl)c(F)c1)c1cc(Cl)c(=O)n(C)c1)N(C)C
InChI Key InChIKey=KWKSDFGERBEDIH-UHFFFAOYSA-N
Data  1 IC50
  Tab Delimited (TSV)   2D SDfile   Computed 3D by Vconf -m prep SDfile
Find this compound or compounds like it in BindingDB:
Activity Spreadsheet -- Enzyme Inhibition Constant Data from BindingDB
Found 1 hit for monomerid = 236440
LigandPNGBDBM236440(US9365576, 193)
Affinity DataIC50:  0.139nMT: 2°C. Assay description: Assay 2: The test is performed in white 384-well plates (Greiner Bio-One, reference 781207) in a total volume of 60 μL by adding 1 μL of compou...
Ligand InfoPC cidPC sid
In DepthDetails US Patent