BDBM236470 US9365576, 226
SMILES COc1nc(ncc1-c1c(C(O)=O)c2C(=O)N(C(c2n1C(C)C)c1ccc(Cl)cc1)c1cc(Cl)c(=O)n(C)c1)N(C)C
InChI Key InChIKey=QFLQQPWYSVBNNV-UHFFFAOYSA-N
Data  1 IC50
  Tab Delimited (TSV)   2D SDfile   Computed 3D by Vconf -m prep SDfile
Find this compound or compounds like it in BindingDB:
Activity Spreadsheet -- Enzyme Inhibition Constant Data from BindingDB
Found 1 hit for monomerid = 236470
LigandPNGBDBM236470(US9365576, 226)
Affinity DataIC50:  0.132nMT: 2°C. Assay description: Assay 2: The test is performed in white 384-well plates (Greiner Bio-One, reference 781207) in a total volume of 60 μL by adding 1 μL of compou...
Ligand InfoPC cidPC sid
In DepthDetails US Patent