BDBM236962 US9388189, 127
SMILES C[C@H](Nc1ncnc(N)c1-c1cncc(OC(F)F)c1)c1nn2ccc(C)c2c(=O)n1-c1ccccc1
InChI Key InChIKey=JCUZYFLTTBHRKZ-HNNXBMFYSA-N
Data  1 IC50
  Tab Delimited (TSV)   2D SDfile   Computed 3D by Vconf -m prep SDfile
Find this compound or compounds like it in BindingDB:
Activity Spreadsheet -- Enzyme Inhibition Constant Data from BindingDB
Found 1 hit for monomerid = 236962
LigandPNGBDBM236962(US9388189, 127)
Affinity DataIC50:  0.400nM. Assay description: PI-3 Kinase HTRF kit (ref. #33-037) and the different PI3K recombinant isoforms (ref. #14-602, ref. #14-603, ref. #14-604, ref. #15-558 for Alpha, Be...
Ligand InfoPC cidPC sid
In DepthDetails US Patent