BDBM236977 US9388189, 157
SMILES COc1ncc(cc1NS(=O)(=O)c1ccc(O)cc1)-c1c(N)ncnc1N[C@@H](C)c1nn2ccc(C)c2c(=O)n1-c1ccccc1
InChI Key InChIKey=UGPVIIQOJRQXIW-IBGZPJMESA-N
Data  1 IC50
  Tab Delimited (TSV)   2D SDfile   Computed 3D by Vconf -m prep SDfile
Find this compound or compounds like it in BindingDB:
Activity Spreadsheet -- Enzyme Inhibition Constant Data from BindingDB
Found 1 hit for monomerid = 236977
LigandPNGBDBM236977(US9388189, 157)
Affinity DataIC50:  0.200nM. Assay description: PI-3 Kinase HTRF kit (ref. #33-037) and the different PI3K recombinant isoforms (ref. #14-602, ref. #14-603, ref. #14-604, ref. #15-558 for Alpha, Be...
Ligand InfoPC cidPC sid
In DepthDetails US Patent