BDBM23711 1-benzoyl-3-nitro-1H-pyrazole::N-Benzoylpyrazole deriv., 19
SMILES [O-][N+](=O)c1ccn(n1)C(=O)c1ccccc1
InChI Key InChIKey=MIWUBRDWBKJULS-UHFFFAOYSA-N
Data  1 KI  4 IC50
  Tab Delimited (TSV)   2D SDfile   Computed 3D by Vconf -m prep SDfile
Find this compound or compounds like it in BindingDB:
Activity Spreadsheet -- Enzyme Inhibition Constant Data from BindingDB
Found 7 hits for monomerid = 23711
TargetNeutrophil elastase(Homo sapiens (Human))
Montana State University
LigandPNGBDBM23711(1-benzoyl-3-nitro-1H-pyrazole | N-Benzoylpyrazole ...)
Affinity DataKi:  46nM ΔG°:  -10.0kcal/molepH: 7.5 T: 2°C. Assay description: HTS was performed in black flat-bottom 96-well microtiter plates. The reaction was initiated by addition of elastase substrate to the reaction buffer...
In DepthDetails ArticlePubMed
TargetProthrombin(Homo sapiens (Human))
Montana State University
LigandPNGBDBM23711(1-benzoyl-3-nitro-1H-pyrazole | N-Benzoylpyrazole ...)
Affinity DataIC50:  1.10E+4nM. Assay description: Thrombin activity was monitored at excitation and emission wavelengths of 355 and 460 nm, respectively. For all compounds tested, the concentration o...
In DepthDetails ArticlePubMed
TargetCathepsin D(Homo sapiens (Human))
Montana State University
LigandPNGBDBM23711(1-benzoyl-3-nitro-1H-pyrazole | N-Benzoylpyrazole ...)
Affinity Data. Assay description: Cathepsin D assays were monitored with a Fluoroskan Ascent FL microtiter plate reader at excitation and emission wavelengths of 340 and 390 nm, respe...
In DepthDetails ArticlePubMed
TargetPlasma kallikrein(Homo sapiens (Human))
Montana State University
LigandPNGBDBM23711(1-benzoyl-3-nitro-1H-pyrazole | N-Benzoylpyrazole ...)
Affinity DataIC50:  1.88E+4nM. Assay description: Kallikrein activity was monitored at excitation and emission wavelengths of 355 and 460 nm, respectively. For all compounds tested, the concentration...
In DepthDetails ArticlePubMed
TargetAminopeptidase N(Sus scrofa (Pig))
Montana State University
LigandPNGBDBM23711(1-benzoyl-3-nitro-1H-pyrazole | N-Benzoylpyrazole ...)
Affinity Data. Assay description: Reactions for aminopeptidase M activity were monitored at 405 nm using a SpectraMax Plus microplate reader. For all compounds tested, the concentrati...
In DepthDetails ArticlePubMed
TargetChymotrypsin-C(Homo sapiens (Human))
Montana State University
LigandPNGBDBM23711(1-benzoyl-3-nitro-1H-pyrazole | N-Benzoylpyrazole ...)
Affinity DataIC50:  7.00E+3nM. Assay description: Chymotrypsin activity was monitored at excitation and emission wavelengths of 355 and 460 nm, respectively. For all compounds tested, the concentrati...
In DepthDetails ArticlePubMed
TargetUrokinase-type plasminogen activator(Homo sapiens (Human))
Montana State University
LigandPNGBDBM23711(1-benzoyl-3-nitro-1H-pyrazole | N-Benzoylpyrazole ...)
Affinity DataIC50:  4.79E+4nM. Assay description: Urokinase activity was monitored at excitation and emission wavelengths of 355 and 460 nm, respectively. For all compounds tested, the concentration ...
In DepthDetails ArticlePubMed