BDBM238188 US9394303, 14
SMILES Cc1nn(Cc2ccc(Oc3ccccc3)cc2)c2nc(C)cc(C(O)=O)c12
InChI Key InChIKey=MYMWHEACODUIMJ-UHFFFAOYSA-N
Data  1 KI  1 IC50
  Tab Delimited (TSV)   2D SDfile   Computed 3D by Vconf -m prep SDfile
Find this compound or compounds like it in BindingDB:
Activity Spreadsheet -- Enzyme Inhibition Constant Data from BindingDB
Found 1 hit for monomerid = 238188
TargetInduced myeloid leukemia cell differentiation protein Mcl-1 homolog(Mus musculus (Mouse))
The Regents Of The University Of Michigan
US Patent
LigandPNGBDBM238188(US9394303, 14)
Affinity DataKi:  3.32E+3nM ΔG°:  -7.47kcal/mole IC50:  1.73E+4nMpH: 7.4 T: 2°C. Assay description: Sensitive and quantitative FP-based binding assays were developed and optimized to determine the binding affinities of small-molecule inhibitors to t...
Ligand InfoPC cidPC sid
In DepthDetails US Patent