BDBM238910 US9403827, 12
SMILES COc1ccc(cc1-c1nc2NC(=O)N(C(c2n1C(C)C)c1ccc(Cl)cc1C)c1cc(Cl)ccc1C)C#N
InChI Key InChIKey=FBAYKMBCSLPEOY-UHFFFAOYSA-N
Data  1 IC50
  Tab Delimited (TSV)   2D SDfile   Computed 3D by Vconf -m prep SDfile
Find this compound or compounds like it in BindingDB:
Activity Spreadsheet -- Enzyme Inhibition Constant Data from BindingDB
Found 1 hit for monomerid = 238910
LigandPNGBDBM238910(US9403827, 12)
Affinity DataIC50:  414nMT: 2°C. Assay description: Assay 2: For selected compounds displaying IC50s between 0.05 and 5 nM on MDM2, a slightly modified assay is used with the following adaptations: 0.1...
Ligand InfoPC cidPC sid
In DepthDetails US Patent