BDBM238914 US9403827, 16
SMILES COc1ncc(-c2nc3NC(=O)N(C(c3n2C(C)C)c2ccc(Cl)cc2C)c2cc(Cl)c(=O)n(C)c2)c(OC)n1
InChI Key InChIKey=IQLOHRMQNATWKF-UHFFFAOYSA-N
Data  1 IC50
  Tab Delimited (TSV)   2D SDfile   Computed 3D by Vconf -m prep SDfile
Find this compound or compounds like it in BindingDB:
Activity Spreadsheet -- Enzyme Inhibition Constant Data from BindingDB
Found 1 hit for monomerid = 238914
LigandPNGBDBM238914(US9403827, 16)
Affinity DataIC50:  3.11E+3nMT: 2°C. Assay description: Assay 2: For selected compounds displaying IC50s between 0.05 and 5 nM on MDM2, a slightly modified assay is used with the following adaptations: 0.1...
Ligand InfoPC cidPC sid
In DepthDetails US Patent