BDBM238920 US9403827, 22
SMILES COc1nc(ncc1-c1nc2NC(=O)N(C(c2n1C(C)C)c1ccc(Cl)cc1)c1cc(Cl)cn(C)c1=O)N(C)C
InChI Key InChIKey=UFHJUOJFZGVQSM-UHFFFAOYSA-N
Data  1 IC50
  Tab Delimited (TSV)   2D SDfile   Computed 3D by Vconf -m prep SDfile
Find this compound or compounds like it in BindingDB:
Activity Spreadsheet -- Enzyme Inhibition Constant Data from BindingDB
Found 1 hit for monomerid = 238920
LigandPNGBDBM238920(US9403827, 22)
Affinity DataIC50:  587nMT: 2°C. Assay description: Assay 2: For selected compounds displaying IC50s between 0.05 and 5 nM on MDM2, a slightly modified assay is used with the following adaptations: 0.1...
Ligand InfoPC cidPC sid
In DepthDetails US Patent