BDBM239752 Roche-Dataset for PDE10A, Compound 308::US9394311, 35
SMILES Cc1cc(Cl)c(C)n2nc(\C=C\c3nc(N4CCCC4)n(C)n3)nc12
InChI Key InChIKey=ZYRDAURLYZBVHM-VOTSOKGWSA-N
Data  2 IC50
  Tab Delimited (TSV)   2D SDfile   Computed 3D by Vconf -m prep SDfile
Find this compound or compounds like it in BindingDB:
Activity Spreadsheet -- Enzyme Inhibition Constant Data from BindingDB
Found 2 hits for monomerid = 239752
TargetcAMP and cAMP-inhibited cGMP 3',5'-cyclic phosphodiesterase 10A(Homo sapiens (Human))
F. Hoffmann-La Roche
LigandPNGBDBM239752(Roche-Dataset for PDE10A, Compound 308 | US9394311...)
Affinity DataIC50:  0.150nM. Assay description: Human PDE10A IC50 values were determined by using purified enzyme (Biomol cat. # SE-534) in a scintillation proximity assay (SPA) in 96 well plates (...
Ligand InfoPC cidPC sid
In DepthDetails ArticlePubMed
TargetcAMP and cAMP-inhibited cGMP 3',5'-cyclic phosphodiesterase 10A(Homo sapiens (Human))
F. Hoffmann-La Roche
LigandPNGBDBM239752(Roche-Dataset for PDE10A, Compound 308 | US9394311...)
Affinity DataIC50:  0.150nMT: 2°C. Assay description: The human PDE10A full length assay was performed in 96-well micro titer plates. The reaction mixture of 50 μl contained 20 mM HEPES pH=7.5/10 mM M...
Ligand InfoPC cidPC sid
In DepthDetails US Patent