BDBM2404 Pyrrolyl Aryl Sulfone (PAS) 25::ethyl 1-[(2-amino-5-chlorobenzene)sulfonyl]-4-(methoxymethyl)-1H-pyrrole-2-carboxylate
SMILES CCOC(=O)c1cc(COC)cn1S(=O)(=O)c1cc(Cl)ccc1N
InChI Key InChIKey=FTVQQRNXPNFCEJ-UHFFFAOYSA-N
Data  1 IC50
  Tab Delimited (TSV)   2D SDfile   Computed 3D by Vconf -m prep SDfile
Find this compound or compounds like it in BindingDB:
Activity Spreadsheet -- Enzyme Inhibition Constant Data from BindingDB
Found 1 hit for monomerid = 2404
TargetGag-Pol polyprotein [588-1027]/[588-1147](Human immunodeficiency virus type 1)
Sapienza University of Rome
LigandPNGBDBM2404(Pyrrolyl Aryl Sulfone (PAS) 25 | ethyl 1-[(2-amino...)
Affinity DataIC50:  600nMpH: 7.8 T: 2°C. Assay description: The IC50 of reverse transcriptase is the concentration that inhibits 50% of recombinant HIV-1 RT RNA-directed DNA polymerase activity in vitro.
In DepthDetails ArticlePubMed