BDBM2407 Ethyl 1-{[5-Chloro-2-(1H-pyrrol-1-yl)phenyl]sulfonyl}-1H-pyrrole-2-carboxylate::Pyrrolyl Aryl Sulfone (PAS) 28::ethyl 1-{[5-chloro-2-(1H-pyrrol-1-yl)benzene]sulfonyl}-1H-pyrrole-2-carboxylate
SMILES CCOC(=O)c1cccn1S(=O)(=O)c1cc(Cl)ccc1-n1cccc1
InChI Key InChIKey=NXVHCZJEXTYRTI-UHFFFAOYSA-N
Data  1 IC50
  Tab Delimited (TSV)   2D SDfile   Computed 3D by Vconf -m prep SDfile
Find this compound or compounds like it in BindingDB:
Activity Spreadsheet -- Enzyme Inhibition Constant Data from BindingDB
Found 1 hit for monomerid = 2407
TargetGag-Pol polyprotein [588-1027]/[588-1147](Human immunodeficiency virus type 1)
Sapienza University of Rome
LigandPNGBDBM2407(Ethyl 1-{[5-Chloro-2-(1H-pyrrol-1-yl)phenyl]sulfon...)
Affinity DataIC50: >1.00E+5nMpH: 7.8 T: 2°C. Assay description: The IC50 of reverse transcriptase is the concentration that inhibits 50% of recombinant HIV-1 RT RNA-directed DNA polymerase activity in vitro.
In DepthDetails ArticlePubMed