BDBM240847 US9394331, 72
SMILES COc1nc(N)nc2n(cnc12)C1OC(CO)[C@@H](O)[C@]11CCCO1
InChI Key InChIKey=OKJOQEQDZTVEBV-YKENJENWSA-N
Data  1 EC50
  Tab Delimited (TSV)   2D SDfile   Computed 3D by Vconf -m prep SDfile
Find this compound or compounds like it in BindingDB:
Activity Spreadsheet -- Enzyme Inhibition Constant Data from BindingDB
Found 1 hit for monomerid = 240847
TargetGenome polyprotein [2420-3010](Hepatitis C virus genotype 1b (isolate Con1) (HCV))
Gilead Pharmasset
US Patent
LigandPNGBDBM240847(US9394331, 72)
Affinity DataEC50: >2.00E+4nMpH: 7.5 T: 2°C. Assay description: The HCV NS5B reaction was performed in a 20 μL mixture containing varying concentrations of the test compound, 1 μM of all four natural ribonuc...
Ligand InfoPC cidPC sid
In DepthDetails US Patent