BDBM243462 US9427440, 3
SMILES COc1ccc2-c3c(C4CCCCC4)c4ccc5cc4n3C[C@@H](Cc2c1)C(=O)N(C)CCOCCN(C)S(=O)(=O)NC5=O
InChI Key InChIKey=JYIVMQPLCGSFGI-XMMPIXPASA-N
Data  1 IC50  1 EC50
  Tab Delimited (TSV)   2D SDfile   Computed 3D by Vconf -m prep SDfile
Find this compound or compounds like it in BindingDB:
Activity Spreadsheet -- Enzyme Inhibition Constant Data from BindingDB
Found 2 hits for monomerid = 243462
TargetGenome polyprotein [2420-3010](Hepatitis C virus genotype 1b (isolate Con1) (HCV))
Janssen Ireland
US Patent
LigandPNGBDBM243462(US9427440, 3)
Affinity DataIC50:  530nMT: 2°C. Assay description: IC50 con1b were determined according to the method as described previously (Pauwels et al, 2007, J Virol 81:6909-19) using a primer-dependent transcr...
Ligand InfoPC cidPC sid
In DepthDetails US Patent
TargetGenome polyprotein [1027-3010](Hepatitis C virus genotype 1b (strain HC-J4) (HCV))
Janssen Ireland
US Patent
LigandPNGBDBM243462(US9427440, 3)
Affinity DataEC50:  79nM. Assay description: The assay utilized the stably transfected cell line Huh-7 luc/neo (hereafter referred to as Huh-Luc). This cell line harbors an RNA encoding a bicist...
Ligand InfoPC cidPC sid
In DepthDetails US Patent