BDBM245145 US9428460, 1
SMILES Fc1ccc(cc1)C(=O)NC[C@H]1CC[C@@H](CC1)Oc1ccnc2c(F)cccc12
InChI Key InChIKey=SMJFZIKHGRDRRK-RZDIXWSQSA-N
Data  1 IC50
  Tab Delimited (TSV)   2D SDfile   Computed 3D by Vconf -m prep SDfile
Find this compound or compounds like it in BindingDB:
Activity Spreadsheet -- Enzyme Inhibition Constant Data from BindingDB
Found 1 hit for monomerid = 245145
TargetAndrogen receptor(Homo sapiens (Human))
Bayer Pharma Aktiengesellschaft
US Patent
LigandPNGBDBM245145(US9428460, 1)
Affinity DataIC50:  240nMT: 2°C. Assay description: For determining the androgen receptor-dependent transcription, a cellular assay system was used, consisting of PC-3 cells (Kaighn et al., Invest. Uro...
Ligand InfoPC cidPC sid
In DepthDetails US Patent