BDBM246326 US9434693, 20
SMILES CC(C)Oc1ccccc1-n1nc(OC2CCN(CC2)S(C)(=O)=O)cc1-c1ccc(Cl)cc1
InChI Key InChIKey=CLSLOWKHEUDMRP-UHFFFAOYSA-N
Data  1 IC50
  Tab Delimited (TSV)   2D SDfile   Computed 3D by Vconf -m prep SDfile
Find this compound or compounds like it in BindingDB:
Activity Spreadsheet -- Enzyme Inhibition Constant Data from BindingDB
Found 1 hit for monomerid = 246326
LigandPNGBDBM246326(US9434693, 20)
Affinity DataIC50:  21.5nM. Assay description: Calcium mobilization responses to KCl depolarization were evaluated by measuring the intensity of calcium-mediated fluorescent signal in the presence...
Ligand InfoPC cidPC sid
In DepthDetails US Patent