BDBM246327 US9434693, 21
SMILES COc1ccccc1-n1nc(OC2CCN(CC2)S(=O)(=O)C(C)C)cc1-c1ccc(Cl)cc1
InChI Key InChIKey=QRGMHEOPAKSEPT-UHFFFAOYSA-N
Data  1 IC50
  Tab Delimited (TSV)   2D SDfile   Computed 3D by Vconf -m prep SDfile
Find this compound or compounds like it in BindingDB:
Activity Spreadsheet -- Enzyme Inhibition Constant Data from BindingDB
Found 1 hit for monomerid = 246327
LigandPNGBDBM246327(US9434693, 21)
Affinity DataIC50:  36nM. Assay description: Calcium mobilization responses to KCl depolarization were evaluated by measuring the intensity of calcium-mediated fluorescent signal in the presence...
Ligand InfoPC cidPC sid
In DepthDetails US Patent