BDBM246331 US9434693, 26
SMILES COc1ccccc1-n1nc(OC2CN(C2)S(C)(=O)=O)cc1-c1ccc(Cl)cc1
InChI Key InChIKey=PSVKDIGKMXLUQF-UHFFFAOYSA-N
Data  1 IC50
  Tab Delimited (TSV)   2D SDfile   Computed 3D by Vconf -m prep SDfile
Find this compound or compounds like it in BindingDB:
Activity Spreadsheet -- Enzyme Inhibition Constant Data from BindingDB
Found 1 hit for monomerid = 246331
LigandPNGBDBM246331(US9434693, 26)
Affinity DataIC50:  31nM. Assay description: Calcium mobilization responses to KCl depolarization were evaluated by measuring the intensity of calcium-mediated fluorescent signal in the presence...
Ligand InfoPC cidPC sid
In DepthDetails US Patent