BDBM246340 US9434693, 35
SMILES COc1ccc(cc1)-c1cc(OC2CC(C)(C)[S@+]([O-])C(C)(C)C2)nn1-c1ccccc1OC
InChI Key InChIKey=HACCLYCGUNUBJY-DWWHJWNJSA-N
Data  1 IC50
  Tab Delimited (TSV)   2D SDfile   Computed 3D by Vconf -m prep SDfile
Find this compound or compounds like it in BindingDB:
Activity Spreadsheet -- Enzyme Inhibition Constant Data from BindingDB
Found 1 hit for monomerid = 246340
LigandPNGBDBM246340(US9434693, 35)
Affinity DataIC50:  7.60nM. Assay description: Calcium mobilization responses to KCl depolarization were evaluated by measuring the intensity of calcium-mediated fluorescent signal in the presence...
Ligand InfoPC cidPC sid
In DepthDetails US Patent