BDBM247064 3-((4-((4-(3-(3-Isopropyl-1-(p-tolyl)-1H-pyrazol-5-yl)ureido)naphthalen-1-yl)oxy)pyrimidin-2-yl)amino)-5-methoxy-N-(2-morpholinoethyl)benzamide::US9701670, 8
SMILES COc1cc(Nc2nccc(Oc3ccc(NC(=O)Nc4cc(nn4-c4ccc(C)cc4)C(C)C)c4ccccc34)n2)cc(c1)C(=O)NCCN1CCOCC1
InChI Key InChIKey=YARHUYMJLJCURZ-UHFFFAOYSA-N
Data  8 IC50
  Tab Delimited (TSV)   2D SDfile   Computed 3D by Vconf -m prep SDfile
Find this compound or compounds like it in BindingDB:
Activity Spreadsheet -- Enzyme Inhibition Constant Data from BindingDB
Found 8 hits for monomerid = 247064
TargetMitogen-activated protein kinase 14(Homo sapiens (Human))
Respivert
US Patent
LigandPNGBDBM247064(3-((4-((4-(3-(3-Isopropyl-1-(p-tolyl)-1H-pyrazol-5...)
Affinity DataIC50:  2nM. Assay description: The inhibitory activities of test compounds against the p38 MAPKα isoform (MAPK14: Invitrogen), are evaluated indirectly by determining the leve...
Ligand InfoPC cidPC sid
In DepthDetails US Patent
TargetProto-oncogene tyrosine-protein kinase Src(Homo sapiens (Human))
Respivert
US Patent
LigandPNGBDBM247064(3-((4-((4-(3-(3-Isopropyl-1-(p-tolyl)-1H-pyrazol-5...)
Affinity DataIC50: <1nM. Assay description: The inhibitory activities of compounds of the invention against c-Src and Syk enzymes (Invitrogen), are evaluated in a similar fashion to that descri...
Ligand InfoPC cidPC sid
In DepthDetails US Patent
TargetTyrosine-protein kinase SYK(Homo sapiens (Human))
Respivert
US Patent
LigandPNGBDBM247064(3-((4-((4-(3-(3-Isopropyl-1-(p-tolyl)-1H-pyrazol-5...)
Affinity DataIC50:  3nM. Assay description: The inhibitory activities of compounds of the invention against Syk enzymes (Invitrogen), are evaluated in a similar fashion to that described herein...
Ligand InfoPC cidPC sid
In DepthDetails US Patent
TargetGlycogen synthase kinase-3 alpha(Homo sapiens (Human))
Respivert
US Patent
LigandPNGBDBM247064(3-((4-((4-(3-(3-Isopropyl-1-(p-tolyl)-1H-pyrazol-5...)
Affinity DataIC50:  1.32E+4nM. Assay description: The inhibitory activities of compounds of the invention against the GSK 3α enzyme isoform (Invitrogen), are evaluated by determining the level o...
Ligand InfoPC cidPC sid
In DepthDetails US Patent
TargetMitogen-activated protein kinase 14(Homo sapiens (Human))
Respivert
US Patent
LigandPNGBDBM247064(3-((4-((4-(3-(3-Isopropyl-1-(p-tolyl)-1H-pyrazol-5...)
Affinity DataIC50:  44nM. Assay description: The inhibitory activities of test compounds against the p38 MAPKα isoform (MAPK14: Invitrogen), are evaluated indirectly by determining the leve...
Ligand InfoPC cidPC sid
In DepthDetails US Patent
TargetProto-oncogene tyrosine-protein kinase Src(Homo sapiens (Human))
Respivert
US Patent
LigandPNGBDBM247064(3-((4-((4-(3-(3-Isopropyl-1-(p-tolyl)-1H-pyrazol-5...)
Affinity DataIC50:  41nM. Assay description: The inhibitory activities of compounds of the invention against c-Src and Syk enzymes (Invitrogen), are evaluated in a similar fashion to that descri...
Ligand InfoPC cidPC sid
In DepthDetails US Patent
TargetTyrosine-protein kinase SYK(Homo sapiens (Human))
Respivert
US Patent
LigandPNGBDBM247064(3-((4-((4-(3-(3-Isopropyl-1-(p-tolyl)-1H-pyrazol-5...)
Affinity DataIC50:  224nM. Assay description: The inhibitory activities of compounds of the invention against Syk enzymes (Invitrogen), are evaluated in a similar fashion to that described herein...
Ligand InfoPC cidPC sid
In DepthDetails US Patent
TargetGlycogen synthase kinase-3 alpha(Homo sapiens (Human))
Respivert
US Patent
LigandPNGBDBM247064(3-((4-((4-(3-(3-Isopropyl-1-(p-tolyl)-1H-pyrazol-5...)
Affinity DataIC50:  7.95E+3nM. Assay description: The inhibitory activities of compounds of the invention against the GSK 3α enzyme isoform (Invitrogen), are evaluated by determining the level o...
Ligand InfoPC cidPC sid
In DepthDetails US Patent