BDBM247993 US9434724, 64
SMILES Fc1cc(Cl)c2c(c[nH]c2c1)C(=O)OCC12CCN(CC1)CC2
InChI Key InChIKey=BIHPJDRKTXPLAC-UHFFFAOYSA-N
Data  1 KI  1 IC50
  Tab Delimited (TSV)   2D SDfile   Computed 3D by Vconf -m prep SDfile
Find this compound or compounds like it in BindingDB:
Activity Spreadsheet -- Enzyme Inhibition Constant Data from BindingDB
Found 1 hit for monomerid = 247993
TargetNeuronal acetylcholine receptor subunit alpha-7(Rattus norvegicus (Rat))
Alpharmagen
US Patent
LigandPNGBDBM247993(US9434724, 64)
Affinity DataKi:  291nM ΔG°:  -9.27kcal/mole IC50:  337nMpH: 7.4 T: 2°C. Assay description: Protocol 1: The assay was conducted following the literature reference Meyer E. M., et al., Analysis of 3-(4-Hydroxy, 2-Methoxybenzylidene) Anabasein...
Ligand InfoPC cidPC sid
In DepthDetails US Patent