BDBM248011 US9434724, 20
SMILES Cc1ccc2[nH]cc(C(=O)OCC34CCN(CC3)CC4)c2c1
InChI Key InChIKey=YSVWQQHBTPMQMR-UHFFFAOYSA-N
Data  1 KI  6 IC50
  Tab Delimited (TSV)   2D SDfile   Computed 3D by Vconf -m prep SDfile
Find this compound or compounds like it in BindingDB:
Activity Spreadsheet -- Enzyme Inhibition Constant Data from BindingDB
Found 6 hits for monomerid = 248011
TargetNeuronal acetylcholine receptor subunit alpha-7(Rattus norvegicus (Rat))
Alpharmagen
US Patent
LigandPNGBDBM248011(US9434724, 20)
Affinity DataKi:  60.1nM ΔG°:  -10.2kcal/mole IC50:  68.1nMpH: 7.4 T: 2°C. Assay description: Protocol 1: The assay was conducted following the literature reference Meyer E. M., et al., Analysis of 3-(4-Hydroxy, 2-Methoxybenzylidene) Anabasein...
Ligand InfoPC cidPC sid
In DepthDetails US Patent
TargetCytochrome P450 2C19(Homo sapiens (Human))
Alpharmagen
US Patent
LigandPNGBDBM248011(US9434724, 20)
Affinity DataIC50: >1.00E+4nM. Assay description: Protocol 2: Stock solution for NCEs (test articles) and standard inhibitors were prepared at a concentration of 20 mM in DMSO. Stock solutions were d...
Ligand InfoPC cidPC sid
In DepthDetails US Patent
TargetCytochrome P450 1A2(Homo sapiens (Human))
Alpharmagen
US Patent
LigandPNGBDBM248011(US9434724, 20)
Affinity DataIC50: >1.00E+4nM. Assay description: Protocol 2: Stock solution for NCEs (test articles) and standard inhibitors were prepared at a concentration of 20 mM in DMSO. Stock solutions were d...
Ligand InfoPC cidPC sid
In DepthDetails US Patent
TargetCytochrome P450 2C9(Homo sapiens (Human))
Alpharmagen
US Patent
LigandPNGBDBM248011(US9434724, 20)
Affinity DataIC50: >1.00E+4nM. Assay description: Protocol 2: Stock solution for NCEs (test articles) and standard inhibitors were prepared at a concentration of 20 mM in DMSO. Stock solutions were d...
Ligand InfoPC cidPC sid
In DepthDetails US Patent
TargetCytochrome P450 3A4(Homo sapiens (Human))
Alpharmagen
US Patent
LigandPNGBDBM248011(US9434724, 20)
Affinity DataIC50: >1.00E+4nM. Assay description: Protocol 2: Stock solution for NCEs (test articles) and standard inhibitors were prepared at a concentration of 20 mM in DMSO. Stock solutions were d...
Ligand InfoPC cidPC sid
In DepthDetails US Patent
TargetCytochrome P450 2D6(Homo sapiens (Human))
Alpharmagen
US Patent
LigandPNGBDBM248011(US9434724, 20)
Affinity DataIC50: >1.00E+4nM. Assay description: Protocol 2: Stock solution for NCEs (test articles) and standard inhibitors were prepared at a concentration of 20 mM in DMSO. Stock solutions were d...
Ligand InfoPC cidPC sid
In DepthDetails US Patent