BDBM248030 US9434724, 57
SMILES COc1cc2c(c[nH]c2cc1F)C(=O)OCC12CCN(CC1)CC2
InChI Key InChIKey=OEQJNUURGDXBCB-UHFFFAOYSA-N
Data  1 KI  7 IC50
  Tab Delimited (TSV)   2D SDfile   Computed 3D by Vconf -m prep SDfile
Find this compound or compounds like it in BindingDB:
Activity Spreadsheet -- Enzyme Inhibition Constant Data from BindingDB
Found 7 hits for monomerid = 248030
TargetNeuronal acetylcholine receptor subunit alpha-7(Rattus norvegicus (Rat))
Alpharmagen
US Patent
LigandPNGBDBM248030(US9434724, 57)
Affinity DataKi:  221nM ΔG°:  -9.44kcal/mole IC50:  257nMpH: 7.4 T: 2°C. Assay description: Protocol 1: The assay was conducted following the literature reference Meyer E. M., et al., Analysis of 3-(4-Hydroxy, 2-Methoxybenzylidene) Anabasein...
Ligand InfoPC cidPC sid
In DepthDetails US Patent
TargetCytochrome P450 3A4(Homo sapiens (Human))
Alpharmagen
US Patent
LigandPNGBDBM248030(US9434724, 57)
Affinity DataIC50: >1.00E+4nMT: 2°C. Assay description: Protocol 1: Studies were carried out in human liver microsomes. Human liver microsomes were purchased from BD Gentest. DMSO stocks were prepared for ...
Ligand InfoPC cidPC sid
In DepthDetails US Patent
TargetCytochrome P450 2C19(Homo sapiens (Human))
Alpharmagen
US Patent
LigandPNGBDBM248030(US9434724, 57)
Affinity DataIC50: >1.00E+4nMT: 2°C. Assay description: Protocol 1: Studies were carried out in human liver microsomes. Human liver microsomes were purchased from BD Gentest. DMSO stocks were prepared for ...
Ligand InfoPC cidPC sid
In DepthDetails US Patent
TargetCytochrome P450 1A2(Homo sapiens (Human))
Alpharmagen
US Patent
LigandPNGBDBM248030(US9434724, 57)
Affinity DataIC50: >1.00E+4nMT: 2°C. Assay description: Protocol 1: Studies were carried out in human liver microsomes. Human liver microsomes were purchased from BD Gentest. DMSO stocks were prepared for ...
Ligand InfoPC cidPC sid
In DepthDetails US Patent
TargetCytochrome P450 2C9(Homo sapiens (Human))
Alpharmagen
US Patent
LigandPNGBDBM248030(US9434724, 57)
Affinity DataIC50: >1.00E+4nMT: 2°C. Assay description: Protocol 1: Studies were carried out in human liver microsomes. Human liver microsomes were purchased from BD Gentest. DMSO stocks were prepared for ...
Ligand InfoPC cidPC sid
In DepthDetails US Patent
TargetCytochrome P450 3A4(Homo sapiens (Human))
Alpharmagen
US Patent
LigandPNGBDBM248030(US9434724, 57)
Affinity DataIC50: >1.00E+4nMT: 2°C. Assay description: Protocol 1: Studies were carried out in human liver microsomes. Human liver microsomes were purchased from BD Gentest. DMSO stocks were prepared for ...
Ligand InfoPC cidPC sid
In DepthDetails US Patent
TargetCytochrome P450 2D6(Homo sapiens (Human))
Alpharmagen
US Patent
LigandPNGBDBM248030(US9434724, 57)
Affinity DataIC50: >1.00E+4nMT: 2°C. Assay description: Protocol 1: Studies were carried out in human liver microsomes. Human liver microsomes were purchased from BD Gentest. DMSO stocks were prepared for ...
Ligand InfoPC cidPC sid
In DepthDetails US Patent