BDBM248034 US9434724, 69
SMILES COc1cc2c(c[nH]c2cc1Cl)C(=O)OCC12CCN(CC1)CC2
InChI Key InChIKey=YFJDHZAUGUIKCO-UHFFFAOYSA-N
Data  1 KI  1 IC50
  Tab Delimited (TSV)   2D SDfile   Computed 3D by Vconf -m prep SDfile
Find this compound or compounds like it in BindingDB:
Activity Spreadsheet -- Enzyme Inhibition Constant Data from BindingDB
Found 1 hit for monomerid = 248034
TargetNeuronal acetylcholine receptor subunit alpha-7(Rattus norvegicus (Rat))
Alpharmagen
US Patent
LigandPNGBDBM248034(US9434724, 69)
Affinity DataKi:  340nM ΔG°:  -9.17kcal/mole IC50:  394nMpH: 7.4 T: 2°C. Assay description: Protocol 1: The assay was conducted following the literature reference Meyer E. M., et al., Analysis of 3-(4-Hydroxy, 2-Methoxybenzylidene) Anabasein...
Ligand InfoPC cidPC sid
In DepthDetails US Patent