BDBM249658 US9447038, 86
SMILES CCc1cc(CN(CC(C)C)C(CC(O)=O)c2ccc(Cl)cc2)ccc1OCCN1C(=O)CCC1=O
InChI Key InChIKey=TWFPYTXAUJBOEA-UHFFFAOYSA-N
Data  1 IC50
  Tab Delimited (TSV)   2D SDfile   Computed 3D by Vconf -m prep SDfile
Find this compound or compounds like it in BindingDB:
Activity Spreadsheet -- Enzyme Inhibition Constant Data from BindingDB
Found 1 hit for monomerid = 249658
TargetC-X-C motif chemokine 10(Homo sapiens (Human))
Sanofi
US Patent
LigandPNGBDBM249658(US9447038, 86)
Affinity DataIC50:  12nMT: 2°C. Assay description: The composition of the binding assay buffer is determined in a course of detailed optimization procedure. This resulted in a binding assay buffer con...
Ligand InfoPC cidPC sid
In DepthDetails US Patent