BDBM249699 US9447038, 127
SMILES COc1cc(CN(CC2CCCC2)C(CC(O)=O)c2ccc3OCCc3c2)ccc1OCCn1c(=O)ccn(C)c1=O
InChI Key InChIKey=CIDBZTRWEVTAGN-UHFFFAOYSA-N
Data  1 IC50
  Tab Delimited (TSV)   2D SDfile   Computed 3D by Vconf -m prep SDfile
Find this compound or compounds like it in BindingDB:
Activity Spreadsheet -- Enzyme Inhibition Constant Data from BindingDB
Found 1 hit for monomerid = 249699
TargetC-X-C motif chemokine 10(Homo sapiens (Human))
Sanofi
US Patent
LigandPNGBDBM249699(US9447038, 127)
Affinity DataIC50:  38nMT: 2°C. Assay description: The composition of the binding assay buffer is determined in a course of detailed optimization procedure. This resulted in a binding assay buffer con...
Ligand InfoPC cidPC sid
In DepthDetails US Patent