BDBM25019 3-[6-methyl-4-(morpholin-4-yl)thieno[3,2-d]pyrimidin-2-yl]phenol::thieno[3,2-d]pyrimidine derivative, 11
SMILES Cc1cc2nc(nc(N3CCOCC3)c2s1)-c1cccc(O)c1
InChI Key InChIKey=IAAWZHBLOYYROY-UHFFFAOYSA-N
Data  1 IC50
  Tab Delimited (TSV)   2D SDfile   Computed 3D by Vconf -m prep SDfile
Find this compound or compounds like it in BindingDB:
Activity Spreadsheet -- Enzyme Inhibition Constant Data from BindingDB
Found 1 hit for monomerid = 25019
LigandPNGBDBM25019(3-[6-methyl-4-(morpholin-4-yl)thieno[3,2-d]pyrimid...)
Affinity DataIC50:  6nMpH: 7.5 T: 2°C. Assay description: Test compounds were added to reaction buffer containing yttrium silicate (Ysi) polylysine SPA beads (Amersham), and the enzyme was added to the assay...
In DepthDetails ArticlePubMed