BDBM25037 N'-[(1E)-{6-chloroimidazo[1,2-a]pyridin-3-yl}methylidene]-N,2-dimethyl-5-nitrobenzene-1-sulfonohydrazide::imidazopyridine derivative, 8d
SMILES CN(\N=C\c1cnc2ccc(Cl)cn12)S(=O)(=O)c1cc(ccc1C)[N+]([O-])=O
InChI Key InChIKey=WGNXALRVIDRNSJ-DJKKODMXSA-N
Data  1 IC50
  Tab Delimited (TSV)   2D SDfile   Computed 3D by Vconf -m prep SDfile
Find this compound or compounds like it in BindingDB:
Activity Spreadsheet -- Enzyme Inhibition Constant Data from BindingDB
Found 1 hit for monomerid = 25037
LigandPNGBDBM25037(N'-[(1E)-{6-chloroimidazo[1,2-a]pyridin-3-yl}methy...)
Affinity DataIC50:  0.770nMpH: 7.4 T: 2°C. Assay description: The test compounds and enzyme were mixed in buffer, and the substrate and [gamma-33P] ATP/ATP were added to the mixture to initiate the reaction. Aft...
In DepthDetails ArticlePubMed