BDBM250525 US10167273, Example 4::US10544126, Example 4::US11512066, Example 4::US9475795, 4
SMILES Cc1nn(C)c(C)c1S(=O)(=O)N1CCC(CC1)Oc1ccc(C)cc1
InChI Key InChIKey=XKRLKQWNEKOBOQ-UHFFFAOYSA-N
Data  4 IC50
  Tab Delimited (TSV)   2D SDfile   Computed 3D by Vconf -m prep SDfile
Find this compound or compounds like it in BindingDB:
Activity Spreadsheet -- Enzyme Inhibition Constant Data from BindingDB
Found 4 hits for monomerid = 250525
TargetProkineticin receptor 1(Homo sapiens (Human))
Takeda Pharmaceutical
US Patent
LigandPNGBDBM250525(US10167273, Example 4 | US10544126, Example 4 | US...)
Affinity DataIC50:  820nMpH: 7.4 T: 2°C. Assay description: Prokineticin receptor 1 (PKR1) antagonists may be functionally assessed by measurement of change in intracellular calcium levels induced by Gq mediat...
In DepthDetails US Patent
TargetProkineticin receptor 1(Homo sapiens (Human))
Takeda Pharmaceutical
US Patent
LigandPNGBDBM250525(US10167273, Example 4 | US10544126, Example 4 | US...)
Affinity DataIC50:  820nM. Assay description: The ability of a compound to block the intracellular release of calcium mediated by PK1 in RBL2H3 cells expressing human PKR1 receptors is determined...
In DepthDetails US Patent
TargetProkineticin receptor 1(Homo sapiens (Human))
Takeda Pharmaceutical
US Patent
LigandPNGBDBM250525(US10167273, Example 4 | US10544126, Example 4 | US...)
Affinity DataIC50:  820nM. Assay description: Prokineticin receptor 1 (PKR1) antagonists may be functionally assessed by measurement of change in intracellular calcium levels induced by Gq mediat...
In DepthDetails US Patent
TargetProkineticin receptor 1(Homo sapiens (Human))
Takeda Pharmaceutical
US Patent
LigandPNGBDBM250525(US10167273, Example 4 | US10544126, Example 4 | US...)
Affinity DataIC50:  820nM. Assay description: Prokineticin receptor 1 (PKR1) antagonists may be functionally assessed by measurement of change in intracellular calcium levels induced by Gq mediat...
In DepthDetails US Patent