BDBM25055 4-{6-chloroimidazo[1,2-a]pyridin-3-yl}-2-[(2-methyl-5-nitrobenzene)sulfinyl]-1,3-thiazole::imidazo[1,2-a]pyridine derivative, 15
SMILES Cc1ccc(cc1S(=O)c1nc(cs1)-c1cnc2ccc(Cl)cn12)[N+]([O-])=O
InChI Key InChIKey=ADSDNLVIHODCEH-UHFFFAOYSA-N
Data  1 IC50
  Tab Delimited (TSV)   2D SDfile   Computed 3D by Vconf -m prep SDfile
Find this compound or compounds like it in BindingDB:
Activity Spreadsheet -- Enzyme Inhibition Constant Data from BindingDB
Found 1 hit for monomerid = 25055
LigandPNGBDBM25055(4-{6-chloroimidazo[1,2-a]pyridin-3-yl}-2-[(2-methy...)
Affinity DataIC50:  31nMpH: 7.4 T: 2°C. Assay description: The test compounds and enzyme were mixed in buffer, and the substrate and [gamma-33P] ATP/ATP were added to the mixture to initiate the reaction. Aft...
In DepthDetails ArticlePubMed