BDBM250570 US10167273, Example 49::US10544126, Example 49::US11512066, Example 49::US9475795, 49
SMILES Cc1nn(C)c(C)c1S(=O)(=O)N1CCC(CC1)C(=O)c1ccc(Cl)cc1
InChI Key InChIKey=UQEVACAWBWELED-UHFFFAOYSA-N
Data  4 IC50
  Tab Delimited (TSV)   2D SDfile   Computed 3D by Vconf -m prep SDfile
Find this compound or compounds like it in BindingDB:
Activity Spreadsheet -- Enzyme Inhibition Constant Data from BindingDB
Found 1 hit for monomerid = 250570
TargetProkineticin receptor 1(Homo sapiens (Human))
Takeda Pharmaceutical
US Patent
LigandPNGBDBM250570(US10167273, Example 49 | US10544126, Example 49 | ...)
Affinity DataIC50:  1.00E+3nM. Assay description: The ability of a compound to block the intracellular release of calcium mediated by PK1 in RBL2H3 cells expressing human PKR1 receptors is determined...
In DepthDetails US Patent